{"text_format":"1","workbook":"xlsx","n_sheets":16,"sheets":["Macro Notice","Tables","VersionChanges","Settings","ShapeEnumeration","ShipPhase","CheckList Color","RiskData","RiskMatrix","AttrData","Sorter","DOIList","CARCount","001-Document Review ","003-TESTING","004-Hull Fairness"],"not_rendered":{"charts":0,"images":24,"macros":1,"external_links":4,"defined_names":106,"comments":4,"pivot_tables":0},"unopened":[],"bounds":{"document_bytes":16777216,"sheet_cells":100000,"rows_first":2000,"rows_last":500,"rows_between":2000,"halvings":0,"cell_chars":16384,"cell_head_chars":4096},"cells_cut":0,"cells_raw":0,"read":"whole","date_system":"1900"}

{"sheet":"Macro Notice","index":0,"n_rows":34,"n_cols":12,"rows_kept":34,"cut":false,"hidden":false,"merged":[[1,11,33,11],[0,1,0,11],[33,0,33,10],[0,0,32,0],[1,1,4,10],[16,6,17,9],[7,1,7,4],[7,6,7,9],[15,6,15,9]]}
["Click Anywhere","If Macros are Running  Click Anywhere"]
[null,"The Risk Assessment Spreadsheet relies heavily on Macros and VBA coding.  In order to proceed further you are required to enable Macros. Please exit Excel and Enable Macros when you reopen.",null,null,null,null,null,null,null,null,null,"Click Anywhere"]
[]
[]
[]
[]
[]
[null,"Initial Options to Permit Macros",null,null,null,null,"When opening the Dashboard"]
[]
[]
{"$rows_left_out":25}
{"sheet":"Tables","index":1,"n_rows":56,"n_cols":17,"rows_kept":56,"cut":false,"hidden":true,"merged":[[9,1,9,2],[9,4,10,9],[25,1,25,2]]}
[null,null,"Personnel","Vessel","Milestone","Schedule","Cost","Operability","Occurrence",null,null,null,null,null,"Administrator (USERNAME)",null,"Failure"]
[1,"Personnel","SOLAS","Mission Degrade","Significant Impact","Significant Impact","Significant Impact","Significant Impact","Unlikely to occur [1.0]",1,null,null,null,null,"Kevin.Kilborn.CTR",null,"Unlikely to occur [1.0]"]
[2,"Vessel","Mission Degrade","Significant Impact","Moderate Impact","Moderate Impact","Moderate Impact","Moderate Impact","May occur in time [1.4]",1.4,null,null,null,null,"Lukasz.Tabor",null,"May occur in time [1.7]"]
[3,"Milestone","Significant Impact","Moderate Impact","Little Impact","Little Impact","Little Impact","Little Impact","Probably will occur in time [1.8]",1.8,null,"Operability",{"$f":"IF($L4=\"Death\",5,IF($L4=\"Injury\",4.8,IF($L4=\"SOLAS\",4.8,IF($L4=\"Mission Degrade\",4.8,IF($L4=\"Significant Impact\",3.5,IF($L4=\"Moderate Impact\",2.5,IF(L4=\"Operability\",3,IF($L4=\"Little Impact\",1))))))))","v":3},null,null,null,"Probably will occur in time [2.4]"]
[4,"Schedule","Moderate Impact","Little Impact",null,null,null,null,"Likely to occur within a short period of time [2.2]",2.2000000000000002,null,null,null,null,null,null,"Likely to occur within a short period of time [3.1]"]
[5,"Cost","Little Impact",null,null,null,null,null,"Likely to occur immediately [2.6]",2.6,null,null,null,null,null,null,"Likely to occur immediately [3.8]"]
[null,null,null,null,null,null,null,null,"Inevitable [3.0]",3]
[]
[]
[null,"OBSWeight",null,null,"Attribute Lookup (Used in Probability of Quality Failure Formula)\nReturn value is set (Up To) the Percent (Ctrl-Alt-F9) Forces calculations"]
{"$rows_left_out":47}
{"sheet":"VersionChanges","index":2,"n_rows":40,"n_cols":4,"rows_kept":40,"cut":false,"hidden":true,"merged":[]}
["Current Version","2.01.25",{"$f":"LEN(B1)","v":7}]
["Version","Description Keep < 255 characters\n(Can't use the VBA Copy (Synchronize) Mechanism without causing 'Unable to Record' downstream problems",136]
["1.00.00","Beta release, including macro notice.",37]
["1.00.10","Rounding checklists so that they'll appear in the same object. ",63]
["1.00.20","1. Configurable X & Y coordinate change values that affect the grouping of checklists into the same shape.  \n2. Revised scatter so that if rounding the riskdata remains the same and the shapes are shifted.\n",206]
["1.00.20","3. Added Debug property that permits changing X & Y coordinates during Matrix creation.\n4. Added matrix legend.",111]
["1.00.25","1. Provide drill-down into Attributes for the Shape selected.\n2. Added Tile button as an additional way to 'scatter' shapes.\n3. Scatter and Tile may be used in conjunction with each other.",188]
["1.00.50","1. Provide colors corresponding to the Risk Matrix Legend\n2. Average X & Y coordinates between the DOI & the Checklist\n3. Was I & N now it's G & L\n4. Y < year * 1; > = 12 < 18 then *1.5; >= 18 months * 2\n",204]
["1.00.50","5. Add a date reviewed to each checklist which should influence both the X & Y\n6. Change the X & Y coordinates to Y - 20 & X - 7.5\n7. Drop column F 'Process Review and G 'Process Quality Modifier\n",196]
["1.00.50","8. Deletion of columns misaligned data.  Needed to provide a merge function.\n9. Mitigation comments were missing\n10.Average row needed to be incorporated in Populate Formula\n11. Total Row needed to be incorporated in Populate Formula\n",234]
{"$rows_left_out":31}
{"sheet":"Settings","index":3,"n_rows":114,"n_cols":45,"rows_kept":114,"cut":false,"hidden":true,"merged":[[4,17,4,18],[5,17,5,18],[3,19,3,20],[4,19,4,20],[0,17,1,20],[2,17,2,18],[2,19,2,20],[3,17,3,18],[5,19,5,20],[0,2,1,4],[13,7,13,16],[17,7,17,16],[16,7,16,16],[14,7,14,16],[15,7,15,16],[6,19,6,20],[6,17,6,18],[0,0,1,1],[5,7,5,16],[10,7,10,16],[2,7,2,16],[6,7,6,16],[4,7,4,16],[7,7,7,16],[8,7,8,16],[9,7,9,16],[0,7,1,16],[3,7,3,16],[3,2,26,4],[12,7,12,16],[21,7,21,16],[59,0,59,14],[22,7,22,16],[35,1,35,4],[32,1,33,4],[34,2,34,4],[38,16,38,20],[28,7,28,16],[29,0,31,0],[29,1,31,1],[29,2,31,4],[37,2,37,4],[28,2,28,4],[38,22,38,26],[24,7,24,16],[8,17,8,18],[8,19,8,20],[7,17,7,18],[7,19,7,20],[11,7,11,16],[20,7,20,16],[18,7,18,16],[19,7,19,16]]}
["Configuration Settings",null,"Options",null,null,null,null,"Import Instructions & Features",null,null,null,null,null,null,null,null,null,"Configuration Settings"]
[]
["Checklist Prefix","  ",null,null,null,null,null,"• Checklists for each ship program use a prefix designation for the ship class.  Please enter that prefix exactly as it is found in the TSM export file (example: DDG1000).",null,null,null,null,null,null,null,null,null,"Level Green\n(Up To)",null,190]
["Data File Directory:","\\Exported Data",null,null,null,null,null,"• Point to the default export directory.  You may use an absolute path by using a drive letter followed by a colon (:), or you may use a relative path beginning with just a backslash (\\).\n• Alternatively run the TSM export (See Import File Process).",null,null,null,null,null,null,null,null,null,"Yellow Level\n(Up To)",null,900]
["File to Process:","F:\\Projects\\Code 300\\Risk Assessmentx\\Exported Data\\20151214_Risk_Assess_data_wit.xlsx",null,null,null,null,null,"• Type the name of the file or press Select File.",null,null,null,null,null,null,null,null,null,"Red Level\n(Starting At)",null,800.1]
["Import:",null,null,null,null,null,null,"• Imports the data in the File to Process into the worksheets",null,null,null,null,null,null,null,null,null,"UI Version",null,"1.10.13; 02/10/2016; Corrected Combined and Phase Selection"]
["Add Rejects/Total Obs comments:",true,null,null,null,null,null,"• Adds Rejects/Total Observatios and (checklist/attribute) information to comment blocks.",null,null,null,null,null,null,null,null,null,"Ship Class",null,"DDG1000"]
["Displays the Comment Block:","No",null,null,null,null,null,"• Shows the comment block. If false comments are available by hovering over the cell.",null,null,null,null,null,null,null,null,null,"Hull No",null,1000]
["Set Print Areas:",false,null,null,null,null,null,"• Sets print area and headings for reports.",null,null,null,null,null,null,null,null,null,"Checklist Total Row",null,-1]
["View Mode:","Normal",null,null,null,null,null,"• Sets the view mode to Print Preview or Normal"]
{"$rows_left_out":105}
{"sheet":"ShapeEnumeration","index":4,"n_rows":185,"n_cols":2,"rows_kept":185,"cut":false,"hidden":true,"merged":[]}
["Description"]
["msoShape10pointStar",149]
["msoShape12pointStar",150]
["msoShape16pointStar",94]
["msoShape24pointStar",95]
["msoShape32pointStar",96]
["msoShape4pointStar",91]
["msoShape5pointStar",92]
["msoShape6pointStar",147]
["msoShape7pointStar",148]
{"$rows_left_out":176}
{"sheet":"ShipPhase","index":5,"n_rows":7,"n_cols":2,"rows_kept":7,"cut":false,"hidden":true,"merged":[]}
["Ship Phase\n(Derived Settings)","Factor"]
["Planning/Procurement",1.5]
["Fabrication",2]
["Assembly/Erection",3]
["Outfit",4]
["Landlevel/Ways",5]
["After Launch/Water",5.5]

{"sheet":"CheckList Color","index":6,"n_rows":1,"n_cols":2,"rows_kept":1,"cut":false,"hidden":true,"merged":[]}
["CheckList","Color"]

{"sheet":"RiskData","index":7,"n_rows":4,"n_cols":4,"rows_kept":4,"cut":false,"hidden":true,"merged":[]}
["CheckList","X-Axis\nPhase Factor","Y-Axis\nProp of Qual Failure","Value"]
["001",5.5,3,16.5]
["003",36.299999999999997,5.45,197.65]
["004",49.5,9,445.5]

{"sheet":"RiskMatrix","index":8,"n_rows":138,"n_cols":104,"rows_kept":138,"cut":false,"hidden":true,"merged":[[9,1,107,1],[5,4,6,102],[120,15,122,63],[123,15,125,63],[126,15,128,63],[119,15,119,63],[119,11,119,14],[120,11,122,14],[118,68,121,106],[123,11,125,14],[126,11,128,14],[127,68,127,105],[111,4,111,103],[23,2,25,2],[35,2,39,2],[57,2,60,2],[76,2,80,2],[101,2,105,2],[113,4,114,38],[7,9,7,13],[7,4,7,8],[7,34,7,38],[7,29,7,33],[7,24,7,28],[7,19,7,23],[7,14,7,18]]}
[]
[]
[]
[]
[]
[null,null,null,null,"Risk Matrix — 1000"]
[]
[]
[null,null,null,0,0.5,1,1.5,2,2.5,3,3.5,4,4.5,5,5.5,6,6.5,7,7.5,8,8.5,9,9.5,10,10.5,11,11.5,12,12.5,13,13.5,14,14.5,15,15.5,16,16.5,17,17.5,18,18.5,19,19.5,20,20.5,21,21.5,22,22.5,23,23.5,24,24.5,25,25.5,26,26.5,27,27.5,28,28.5,29,29.5,30,30.5,31,31.5,32,32.5,33,33.5,34,34.5,35,35.5,36,36.5,37,37.5,38,38.5,39,39.5,40,40.5,41,41.5,42,42.5,43,43.5,44,44.5,45,45.5,46,46.5,47,47.5,48,48.5,49,49.5,50]
[null,"Probability",null,50]
{"$rows_left_out":129}
{"sheet":"AttrData","index":9,"n_rows":4,"n_cols":4,"rows_kept":4,"cut":false,"hidden":true,"merged":[]}
["Attribute","X-Axis","Y-Axis","Value"]
["SIGN OFF - COMPARTMENT VERIFIED COMPLETE ",3.61,2.8499999999999996,10.288499999999999]
["CANCELLATION < AFTER 0700 ",3.61,14.249999999999998,51.442499999999988]
["CANCELLATION > BEFORE 0700",3.61,14.249999999999998,51.442499999999988]

{"sheet":"Sorter","index":10,"n_rows":3,"n_cols":5,"rows_kept":3,"cut":false,"hidden":true,"merged":[]}
["oval-3",1610.2501220703125,1169.25,33,1232.25]
["oval-2",1625.2501220703125,1184.25,33,1316.25]
["oval-1",1640.2501220703125,1199.25,33,1320]

{"sheet":"DOIList","index":11,"n_rows":190,"n_cols":53,"rows_kept":190,"cut":false,"hidden":true,"merged":[[1,16,1,20],[0,2,0,4],[1,22,1,26]]}
["DOI Formulas",null,"M - Mandatory / Statutory\nS - Specification driven\nP - Builder Process\nC - Crew/Customer request",null,null,null,null,null,null,null,null,null,"Reviewed:","2009-08-01",{"$f":"IF(NOW()-N1< 365,1,IF(NOW()-N1>545,2,1.5))","v":2},null,null,null,null,null,null,"Phase Factor",{"$f":"VLOOKUP(ShipPhase,ShipPhase!A2:B1000,2,FALSE)","v":5.5}]
["DOI","Process Details","Click 'Gorverned by' to reset","Oversight Requirements","Necessity Modifier","Total OBS","OBS Weight","Procedure Evaluation Reject Rate","Reject Probability","Method A Count","Method A Weight","Method B Count","Method B Weight","N/A","CAR Average","Probability of Quality Failure","Failure Affects",null,null,null,null,"Impact Modifier","Severity of Failure",null,null,null,null,"Severity Modifier","Severity Factor","Max Risk","PE Date","Elapsed Months"]
[null,null,null,null,{"$f":"MAX(E4:E30)","v":1.25},null,null,null,null,null,null,null,null,null,null,{"$f":"MAX(P4:P30)","v":2.5},"Personnel","Vessel","Milestone","Schedule","Cost",{"$f":"MAX(V4:V30)","v":1},"SOLAS","Mission Degrade","Significant Impact","Moderate Impact","Little Impact",{"$f":"MAX(AB4:AB30)","v":1},{"$f":"V3*AB3*$W$1","v":5.5},{"$f":"MAX(AD4:AD30)","v":13.75},null,{"$f":"IF(AE4>36500,(YEAR(TODAY())-YEAR(AE4))*12+(MONTH(TODAY())-MONTH(AE4)),\"\")","v":79}]
["BIW-NDT-WP","BIW-NDT-WRITTEN PRACTICE","Proc","P",{"$f":"IF($D4=\"M\",2,IF($D4=\"C\",1,IF($D4=\"P\",1.25,IF($D4=\"S\",1.5))))","v":1.25},0,{"$f":"VLOOKUP($F4,OBSWeight,2,TRUE)","v":2},0,{"$f":"GetRejectProbability(\"001-Document\", H4)","v":"1"},{"$f":"GetCARCountAttr(\"A\",\"001-Document Review \", A4,I4)","v":0},{"$f":"GetCARWeight(\"A\",J4)","v":1},{"$f":"GetCARCountAttr(\"B\",\"001-Document Review \",A4,K4)","v":0},{"$f":"GetCARWeight(\"B\",L4)","v":1},null,{"$f":"(K4+M4)/2","v":1},{"$f":"(E4*G4*I4)*O4","v":2.5},1,1,1,1,1,{"$f":"MAX($Q4,$R4,$S4,$T4,$U4)","v":1},1,1,1,1,1,{"$f":"MAX($W4,$X4,$Y4,$Z4,$AA4)","v":1},{"$f":"$V4*$AB4*$W$1","v":5.5},{"$f":"P4*AC4","v":13.75},"2011-10-20"]
["DOI 10-120","VENTILATION INSPECTION PRIOR TO COVERING AND TESTING","Proc","P",{"$f":"IF($D5=\"M\",2,IF($D5=\"C\",1,IF($D5=\"P\",1.25,IF($D5=\"S\",1.5))))","v":1.25},0,2,0,{"$f":"GetRejectProbability(\"001-Document\", H5)","v":"1"},{"$f":"GetCARCountAttr(\"A\",\"001-Document Review \", A5,I5)","v":0},{"$f":"GetCARWeight(\"A\",J5)","v":1},{"$f":"GetCARCountAttr(\"B\",\"001-Document Review \",A5,K5)","v":0},{"$f":"GetCARWeight(\"B\",L5)","v":1},null,{"$f":"(K5+M5)/2","v":1},{"$f":"(E5*G5*I5)*O5","v":2.5},1,1,1,1,1,{"$f":"MAX($Q5,$R5,$S5,$T5,$U5)","v":1},1,1,1,1,1,{"$f":"MAX($W5,$X5,$Y5,$Z5,$AA5)","v":1},{"$f":"$V5*$AB5*$W$1","v":5.5},{"$f":"P5*AC5","v":13.75}]
["DOI-06-101","Hull Structural Material Control","Proc","P",1.25,0,2,0,"1",0,1,0,1,null,1,2.5,1,1,1,1,1,1,1,1,1,1,1,1,5.5,13.75]
["DOI-06-103","Issuing and Processing the Record of Quality Deficiency (RQD)","Proc","P",1.25,0,2,0,"1",0,1,0,1,null,1,2.5,1,1,1,1,1,1,1,1,1,1,1,1,5.5,13.75,"2011-09-15"]
["DOI-06-104","Quality Assurance Receipt Inspection","Proc","P",1.25,0,2,0,"1",0,1,0,1,null,1,2.5,1,1,1,1,1,1,1,1,1,1,1,1,5.5,13.75,"2012-05-22","2012-01-27","2011-11-29","2011-10-26","2011-09-15","2010-10-01"]
["DOI-06-106","DOI 06-106, Non-Destructive Testing (NDT) of Hull Structure","Proc","P",1.25,0,2,0,"1",0,1,0,1,null,1,2.5,1,1,1,1,1,1,1,1,1,1,1,1,5.5,13.75,"2012-02-29","2012-01-25"]
["DOI-06-106 MT","Non-Destructive Testing (NDT)  - MT","Proc","P",1.25,0,2,0,"1",0,1,0,1,null,1,2.5,1,1,1,1,1,1,1,1,1,1,1,1,5.5,13.75]
{"$rows_left_out":181}
{"sheet":"CARCount","index":12,"n_rows":11,"n_cols":7,"rows_kept":11,"cut":false,"hidden":true,"merged":[]}
["CheckList","AttributeNo","CARType","Key","CLKey","Count","CLCount"]
["003","003-A3-PE-0025","B","003-003-A3-PE-0025-B","003-B",1,1]
["003","003-PE-0036","A","003-003-PE-0036-A","003-A",1,1]
["005","005-PE-0070","A","005-005-PE-0070-A","005-A",1,7]
["005","005-PE-0067","A","005-005-PE-0067-A","005-A",1]
["005","005-PE-0065","A","005-005-PE-0065-A","005-A",3]
["005","005-PE-0066","A","005-005-PE-0066-A","005-A",1]
["005","005-PE-0071","A","005-005-PE-0071-A","005-A",1]
["005A","005A-PE-0076","B","005A-005A-PE-0076-B","005A-B",1,1]
["014","014-PVI-0128","A","014-014-PVI-0128-A","014-A",1,1]
{"$rows_left_out":2}
{"sheet":"001-Document Review ","index":13,"n_rows":28,"n_cols":31,"rows_kept":28,"cut":false,"hidden":true,"merged":[[0,2,0,4],[1,16,1,20],[1,22,1,26]]}
["Checklist\nFormulas",null,"M - Mandatory / Statutory\nS - Specification driven\nP - Builder Process\nC - Crew/Customer request",null,null,null,null,null,null,null,null,null,"Reviewed:","2009-08-01",{"$f":"IF(NOW()-N1< 365,1,IF(NOW()-N1>545,2,1.5))","v":2},null,null,null,null,null,null,"Phase Factor",{"$f":"VLOOKUP(ShipPhase,ShipPhase!A2:B1000,2,FALSE)","v":5.5}]
[null,"Process Details","Governed by","Oversight Requirements","Necessity Modifier","Total OBS","OBS Weight","Procedure Evaluation Reject Rate","Reject Probability","Method A Count","Method A Weight","Method B Count","Method B Weight","N/A","CAR Average","Probability of Quality Failure","Failure Affects",null,null,null,null,"Impact Modifier","Severity of Failure",null,null,null,null,"Severity Modifier","Severity Factor","Max Risk","Date"]
[null,null,null,null,{"$f":"MAX(E4:E18)","v":1.5},null,null,null,null,null,null,null,null,null,null,{"$f":"MAX(P4:P18)","v":3},"Personnel","Vessel","Milestone","Schedule","Cost",{"$f":"MAX(V4:V18)","v":1},"SOLAS","Mission Degrade","Significant Impact","Moderate Impact","Little Impact",{"$f":"MAX(AB4:AB18)","v":1},{"$f":"V3*AB3*$W$1","v":5.5},{"$f":"MAX(AD4:AD18)","v":16.5}]
["001-DR-0001","Purpose Adequate","Spec","S",{"$f":"IF($D4=\"M\",2,IF($D4=\"C\",1,IF($D4=\"P\",1.25,IF($D4=\"S\",1.5))))","v":1.5},0,{"$f":"VLOOKUP($F4,OBSWeight,2,TRUE)","v":2},0,{"$f":"GetRejectProbability(\"001-Document\", H4)","v":"1"},{"$f":"GetCARCountAttr(\"A\",\"001-Document Review \", A4,I4)","v":0},{"$f":"GetCARWeight(\"A\",J4)","v":1},{"$f":"GetCARCountAttr(\"B\",\"001-Document Review \",A4,K4)","v":0},{"$f":"GetCARWeight(\"B\",L4)","v":1},null,{"$f":"(K4+M4)/2","v":1},{"$f":"(E4*G4*I4)*O4","v":3},1,1,1,1,1,{"$f":"MAX($Q4,$R4,$S4,$T4,$U4)","v":1},1,1,1,1,1,{"$f":"MAX($W4,$X4,$Y4,$Z4,$AA4)","v":1},{"$f":"$V4*$AB4*$W$1","v":5.5},{"$f":"P4*AC4","v":16.5}]
["001-DR-0002","Scope Adequate","Spec","S",1.5,0,2,0,"1",0,1,0,1,null,1,3,1,1,1,1,1,1,1,1,1,1,1,1,5.5,16.5]
["001-DR-0003","References Adequate","Spec","S",1.5,0,2,0,"1",0,1,0,1,null,1,3,1,1,1,1,1,1,1,1,1,1,1,1,5.5,16.5]
["001-DR-0004","Definitions Adequate","Spec","S",1.5,0,2,0,"1",0,1,0,1,null,1,3,1,1,1,1,1,1,1,1,1,1,1,1,5.5,16.5]
["001-DR-0005","Procedure Adequate","Spec","S",1.5,0,2,0,"1",0,1,0,1,null,1,3,1,1,1,1,1,1,1,1,1,1,1,1,5.5,16.5]
["001-DR-0006","Records Adequate","Spec","S",1.5,0,2,0,"1",0,1,0,1,null,1,3,1,1,1,1,1,1,1,1,1,1,1,1,5.5,16.5]
["001-DR-0007","Responsibilities Adequate","Spec","S",1.5,0,2,0,"1",0,1,0,1,null,1,3,1,1,1,1,1,1,1,1,1,1,1,1,5.5,16.5]
{"$rows_left_out":19}
{"sheet":"003-TESTING","index":14,"n_rows":40,"n_cols":31,"rows_kept":40,"cut":false,"hidden":true,"merged":[[0,2,0,4],[1,16,1,20],[1,22,1,26]]}
["Checklist\nFormulas",null,"M - Mandatory / Statutory\nS - Specification driven\nP - Builder Process\nC - Crew/Customer request",null,null,null,null,null,null,null,null,null,"Reviewed:","2009-08-01",{"$f":"IF(NOW()-N1< 365,1,IF(NOW()-N1>545,2,1.5))","v":2},null,null,null,null,null,null,"Phase Factor",{"$f":"VLOOKUP(ShipPhase,ShipPhase!A2:B1000,2,FALSE)","v":5.5}]
[null,"Process Details","Governed by","Oversight Requirements","Necessity Modifier","Total OBS","OBS Weight","Procedure Evaluation Reject Rate","Reject Probability","Method A Count","Method A Weight","Method B Count","Method B Weight","N/A","CAR Average","Probability of Quality Failure","Failure Affects",null,null,null,null,"Impact Modifier","Severity of Failure",null,null,null,null,"Severity Modifier","Severity Factor","Max Risk","Date"]
[null,null,null,null,{"$f":"MAX(E4:E30)","v":1.5},null,null,null,null,null,null,null,null,null,null,{"$f":"MAX(P4:P30)","v":21},"Personnel","Vessel","Milestone","Schedule","Cost",{"$f":"MAX(V4:V30)","v":2.2000000000000002},"SOLAS","Mission Degrade","Significant Impact","Moderate Impact","Little Impact",{"$f":"MAX(AB4:AB30)","v":3},{"$f":"V3*AB3*$W$1","v":36.300000000000004},{"$f":"MAX(AD4:AD30)","v":762.30000000000007}]
["003-A0-PE-0022","Notification of Release of Compartment/Doors/Hatches/ Scuttles","Spec","S",{"$f":"IF($D4=\"M\",2,IF($D4=\"C\",1,IF($D4=\"P\",1.25,IF($D4=\"S\",1.5))))","v":1.5},0,{"$f":"VLOOKUP($F4,OBSWeight,2,TRUE)","v":2},0,{"$f":"GetRejectProbability(\"003\", H4)","v":"1"},{"$f":"GetCARCountAttr(\"A\",\"003-TESTING\", A4,I4)","v":0},{"$f":"GetCARWeight(\"A\",J4)","v":1},{"$f":"GetCARCountAttr(\"B\",\"003-TESTING\",A4,K4)","v":0},{"$f":"GetCARWeight(\"B\",L4)","v":1},null,{"$f":"(K4+M4)/2","v":1},{"$f":"(E4*G4*I4)*O4","v":3},2.2000000000000002,1.8,1.8,1.8,2.2000000000000002,{"$f":"MAX($Q4,$R4,$S4,$T4,$U4)","v":2.2000000000000002},1.8,1.4,1.8,1.4,1.4,{"$f":"MAX($W4,$X4,$Y4,$Z4,$AA4)","v":1.8},{"$f":"$V4*$AB4*$W$1","v":21.78},{"$f":"P4*AC4","v":65.34}]
["003-A1-PE-0023","Notification of Previously Released Test That was Cancelled, Corrected or Duplicate","Spec","S",1.5,22,1.9,0,"1",0,1,0,1,null,1,2.8499999999999996,2.2000000000000002,1.8,1.8,1.8,2.2000000000000002,2.2000000000000002,1.8,1.4,1.8,1.4,1.4,1.8,21.78,62.072999999999993,"2015-12-02"]
["003-A2-PE-0024","Release Cancelled/Not Ready for Inspection","Spec","S",1.5,10,1.9,0,"1",0,1,0,1,null,1,2.8499999999999996,2.2000000000000002,1.8,1.8,1.8,2.2000000000000002,2.2000000000000002,1.8,1.4,1.8,1.4,1.4,1.8,21.78,62.072999999999993,"2015-12-01"]
["003-A3-PE-0025","Notification of Late Release","Spec","S",1.5,8,2,0.125,"5",0,1,1,1.8,null,1.4,21,2.2000000000000002,1.8,1.8,1.8,2.2000000000000002,2.2000000000000002,1.8,1.4,3,1.4,1.4,3,36.300000000000004,762.30000000000007,"2015-12-03"]
["003-A4-PE-0026","Ongoing Test","Spec","S",1.5,126,1.6,0,"1",0,1,0,1,null,1,2.4000000000000004,2.2000000000000002,1.8,1.8,1.8,2.2000000000000002,2.2000000000000002,1.8,1.4,1.8,1.4,1.4,1.8,21.78,52.272000000000013,"2015-12-03"]
["003-A5-PE-0027","Test Correction","Spec","S",1.5,5,2,0,"1",0,1,0,1,null,1,3,2.2000000000000002,1.8,1.8,1.8,2.2000000000000002,2.2000000000000002,1.8,1.4,1.8,1.4,1.4,1.8,21.78,65.34,"2015-11-17"]
["003-A6-PE-0028","Test/Inspection Outside Normal Working Hours","Spec","S",1.5,5,2,0,"1",0,1,0,1,null,1,3,2.2000000000000002,1.8,1.8,1.8,2.2000000000000002,2.2000000000000002,1.8,1.4,1.8,1.4,1.4,1.8,21.78,65.34,"2015-12-04"]
{"$rows_left_out":31}
{"sheet":"004-Hull Fairness","index":15,"n_rows":29,"n_cols":31,"rows_kept":29,"cut":false,"hidden":true,"merged":[[0,2,0,4],[1,16,1,20],[1,22,1,26]]}
["Checklist\nFormulas",null,"M - Mandatory / Statutory\nS - Specification driven\nP - Builder Process\nC - Crew/Customer request",null,null,null,null,null,null,null,null,null,"Reviewed:","2009-08-01",{"$f":"IF(NOW()-N1< 365,1,IF(NOW()-N1>545,2,1.5))","v":2},null,null,null,null,null,null,"Phase Factor",{"$f":"VLOOKUP(ShipPhase,ShipPhase!A2:B1000,2,FALSE)","v":5.5}]
[null,"Process Details","Governed by","Oversight Requirements","Necessity Modifier","Total OBS","OBS Weight","Procedure Evaluation Reject Rate","Reject Probability","Method A Count","Method A Weight","Method B Count","Method B Weight","N/A","CAR Average","Probability of Quality Failure","Failure Affects",null,null,null,null,"Impact Modifier","Severity of Failure",null,null,null,null,"Severity Modifier","Severity Factor","Max Risk","Date"]
[null,null,null,null,{"$f":"MAX(E4:E19)","v":1.5},null,null,null,null,null,null,null,null,null,null,{"$f":"MAX(P4:P19)","v":10.499999999999998},"Personnel","Vessel","Milestone","Schedule","Cost",{"$f":"MAX(V4:V19)","v":3},"SOLAS","Mission Degrade","Significant Impact","Moderate Impact","Little Impact",{"$f":"MAX(AB4:AB19)","v":3},{"$f":"V3*AB3*$W$1","v":49.5},{"$f":"MAX(AD4:AD19)","v":519.74999999999989}]
["003-Z-Z-0032","Quick OBS","Spec","S",{"$f":"IF($D4=\"M\",2,IF($D4=\"C\",1,IF($D4=\"P\",1.25,IF($D4=\"S\",1.5))))","v":1.5},0,{"$f":"VLOOKUP($F4,OBSWeight,2,TRUE)","v":2},0,{"$f":"GetRejectProbability(\"004-Hull\", H4)","v":"1"},{"$f":"GetCARCountAttr(\"A\",\"004-Hull Fairness\", A4,I4)","v":0},{"$f":"GetCARWeight(\"A\",J4)","v":1},{"$f":"GetCARCountAttr(\"B\",\"004-Hull Fairness\",A4,K4)","v":0},{"$f":"GetCARWeight(\"B\",L4)","v":1},null,{"$f":"(K4+M4)/2","v":1},{"$f":"(E4*G4*I4)*O4","v":3},1.8,2.2000000000000002,3,1,2.2000000000000002,{"$f":"MAX($Q4,$R4,$S4,$T4,$U4)","v":3},2.6,1.4,2.6,2.6,3,{"$f":"MAX($W4,$X4,$Y4,$Z4,$AA4)","v":3},{"$f":"$V4*$AB4*$W$1","v":49.5},{"$f":"P4*AC4","v":148.5}]
["004-PVI-0049","Local Flatness Below 01 Level","Spec","S",1.5,0,2,0,"1",0,1,0,1,null,1,3,1.8,2.2000000000000002,3,1,2.2000000000000002,3,2.6,1.4,2.6,2.6,3,3,49.5,148.5]
["004-PVI-0050","Weld Fariness","Spec","S",1.5,0,2,0,"1",0,1,0,1,null,1,3,1.8,2.2000000000000002,3,1,2.2000000000000002,3,2.6,1.4,2.6,2.6,3,3,49.5,148.5]
["004-PVI-0051","Local Flatness Above 01 Level","Spec","S",1.5,200,1.4,{"$f":"87/200","v":0.435},"5",0,1,0,1,null,1,10.499999999999998,1.8,2.2000000000000002,3,1,2.2000000000000002,3,2.6,1.4,2.6,2.6,3,3,49.5,519.74999999999989]
["004-PVI-0052","Vertical Weld Fairness","Spec","S",1.5,0,2,0,"1",0,1,0,1,null,1,3,1.8,2.2000000000000002,3,1,2.2000000000000002,3,2.6,1.4,2.6,2.6,3,3,49.5,148.5]
["004-PVI-0053","Horizontal Weld Fariness","Spec","S",1.5,0,2,0,"1",0,1,0,1,null,1,3,1.8,2.2000000000000002,3,1,2.2000000000000002,3,2.6,1.4,2.6,2.6,3,3,49.5,148.5]
["004-PVI-0054","Verify Radii to Design","Spec","S",1.5,0,2,0,"1",0,1,0,1,null,1,3,1.8,2.2000000000000002,3,1,2.2000000000000002,3,2.6,1.4,2.6,2.6,3,3,49.5,148.5]
{"$rows_left_out":19}